patient_id,culture,sex,age,date_of_birth,title,given_name,surname,state,suburb,postcode,street_number,address_1,address_2,phone_number,soc_sec_id
rec-0-dup-0, chi, f,26,19930413, , kyle, , wan, moree,2607,31, tangari street, camusfearna, 08 01980712, 
rec-0-dup-1, chi, ,26,19930413, , kyli, ni, wq, melville,2617,123, tangari street, camusfearna, 08 01920712, 
rec-0-dup-2, chi, f,26,19930413, , kyle, nk, wu, melville,2617,13, tangar istreet, , 08 01880712, 
rec-0-dup-3, chi, f,26,19930453, , kylh, ni, wy, melvixle,2617,13, tangari stfeet, camusfearna, 08 01980712, 
rec-0-dup-4, chi, f,62,19930413, , kyle, ni, wa, melvbille,2613,13, tangari ctreet, burnside, 08 01980712, 
rec-0-org,   chi, f,26,19930413, , kyle, ni, wa, melville,2617,13, tangari street, camusfearna, 08 01980712, 
rec-1-dup-0, tha, f, ,19720529, , cheksea, , vi, salisbury east,6010,37, chermside street, , 8 72142822, 
rec-1-dup-1, tha, f, ,19720529, , chelsa, , vic, salisburys east,6010,43, chermsidefstreet, , 8 72124822, 
rec-1-dup-2, tha, f, , , , cheldea, , vkc, salisbury east,6010,33, chermsidesstreet, bega flats, 8 72124822, 
rec-1-org,   tha, f, ,19720529, , chelsea, , vic, salisbury east,6010,34, chermside street, bega flats, 8 72124822, 
rec-10-dup-0, eng, ,25, , sgt, bailley, mcnwabb, , forbes,4181,3, herronjcrescent, pineview farm, 04 86372403, 
rec-10-dup-1, eng, f,52, , sgt, bailley, , , forbes,4118,3, herron cvescent, , 04 86372403, 
rec-10-dup-2, eng, f,25, , sgt, bailey, couzens, , forbrs,4118,4, herron crescent, , , 
rec-10-dup-3, eng, f, , , sgt, bailley, mcnabb, , fornes,4118,4, herron crescent, pinevidw farm, 04 86372403, 
rec-10-dup-4, eng, r,25, , sgt, baily, mcnabb, , forbes,5118,3, herron crescent, , 04 86373403, 
rec-10-org,   eng, f,25, , sgt, bailey, mcnabb, , forbes,4118,3, herron crescent, pineview farm, 04 86372403, 
rec-100-dup-0, usa, ,23,19961117, , dimitri, carpetner, ws, gabbin,3101,35, leichharde street, dookanooka, 08 99512443, 
rec-100-dup-1, usa, f,23,19961117, , dimitri, carpenter, wa, gabnin,3110,34, leichhardr street, caloundra family medical practice trinit, 08 99521443, 
rec-100-dup-2, usa, f,24,19961117, , dimitri, carpenfer, waz, gabbin,3101,35, caloundra family medical practice trinit, leichhardt street, 08 99512443, 
rec-100-org,   usa, f,23,19961117, , dimitri, carpenter, wa, gabbin,3101,35, leichhardt street, caloundra family medical practice trinit, 08 99512443, 
rec-1000-dup-0, usa, , ,19107012, , zachary, guzman, , north haven,3118,90, carbeen syreet, , 02 11995580, 
rec-1000-dup-1, usa, f, ,19100712, , zachamy, gujzman, , northhaven,3181,19, , , 02 11995580, 
rec-1000-org,   usa, f, ,19100712, , zachary, guzman, , north haven,3181,10, carbeen street, , 02 11995580, 
rec-1001-dup-0, rom, f,35, , ms, guglielmo, , ss, aron bay,3250,11, scantlebury crescent, , 7 02216984, 
rec-1001-dup-1, rom, f,35,19840425, ms, , antonzescu, sa, arno ay,3250,12, scantleburyy crescent, , 7 02216984, 
rec-1001-dup-2, rom, f,53,19840425, ms, olivia, antonesu, sa, arno by,3250,11, scantleburyzcrescent, , 7 02216984, 
rec-1001-dup-3, rom, m,31,19840425, ms, william, antonescu, sa, arnopbay,3250,53, scantleburqy crescent, , 7 02216984, 
rec-1001-org,   rom, f,35,19840425, ms, william, antonescu, sa, arno bay,3250,11, scantlebury crescent, , 7 02216984, 
rec-1002-dup-0, eng, f,13,20060518, , tia, patrickson, viv, chapple vle,4007,18, alsop cose, , 08 38863140, 
rec-1002-dup-1, eng, f,13,20069518, , benedict, patrickson, vic, chapple vale,407,1, alsop close, , 618 65117075, 
rec-1002-org,   eng, f,13,20060518, , tia, patrickson, vic, chapple vale,4007,16, alsop close, , 618 61517075, 
rec-1003-dup-0, eng, v,27, , ms, cnonor, , ql, biggeraw aters,3181,100, marshall street, rivoina, 613 54745170,3778618
rec-1003-dup-1, eng, f,27, , ms, conner, , qls, biggera waters,3181,100, marshall atreet, , 613 54754170,3778618
rec-1003-dup-2, eng, r,27, , , connor, , qld, biggera qaters,3181,120, marshall street, rivonai, 613 54745170,3778618
rec-1003-dup-3, eng, f,72, , ms, connr, , qld, biggera waters,3181,100, marshallkstreet, , 613 54745170,37782618
rec-1003-dup-4, eng, f,27, , ms, connro, , qld, biggera aters,3181,1005, marshall ttreet, rivonia, 613 54745170, 
rec-1003-org,   eng, f,27, , ms, connor, , qld, biggera waters,3181,100, marshall street, rivonia, 613 54745170,3778618
rec-1004-dup-0, fin, ,34,19830919, ms, , hanninen, sa, eimeo,6330,27, donniso place, , 617 05635713, 
rec-1004-dup-1, fin, f,63,19830319, ms, jasmime, hanninem, ss, imeo,6330,27, donnison place, , 617 05635713, 
rec-1004-dup-2, fin, f,36,19830319, ms, jasmine, hanninen, ss, eieo,6330,7, donnisondplace, , 617 05625713, 
rec-1004-org,   fin, f,36,19830319, ms, jasmine, hanninen, sa, eimeo,6330,27, donnison place, , 617 05635713, 
rec-1005-dup-0, eng, ,37,19820514, dr, tennyson, oliver, vic, yetna,4580,36, burdekin street, , , 
rec-1005-dup-1, eng, m,33, , dr, olievr, tennyson, ws, yetna,4850,63, burdekin street, , , 
rec-1005-dup-2, eng, t,37,19820514, dr, tennyson, oliver, wa, yetna,4805,32, burdekin street, , , 
rec-1005-org,   eng, m,37,19820514, dr, oliver, tennyson, wa, yetna,4850,36, burdekin street, , , 
rec-1006-dup-0, , f,29, , , lata, hammet, nsq, bihya,2210,7, , niana, , 
rec-1006-dup-1, , f,38, , , lara, hamker, nsw, bimya,2201,1, , niana, , 
rec-1006-dup-2, , ,29, , , lara, hammxer, nsq, binya,2201,8, , nia na, , 
rec-1006-dup-3, , f,20, , , lara, hammer, nsw, binha,2201,7, , , , 
rec-1006-org,   , f,29, , , lara, hammer, nsw, binya,2210,8, , niana, , 
rec-1007-dup-0, eng, f,41,19280221, ms, blke, merrinckson, nsw, bigga,3805,9, rayner place, , 612 47858446, 
rec-1007-dup-1, eng, ,41,19781227, ms, blake, merrickson, nsw, bigga,3850,90, raynerplace, , 612 47588446, 
rec-1007-dup-2, eng, f,30,19781267, ms, blayke, merrickson, nxw, bigga,3805,9, rayner place, , 612 47588446, 
rec-1007-dup-3, eng, f,41,19781227, ms, blale, merriceson, nww, bigga,3805,9, raynerjplace, , 612 47588446, 
rec-1007-org,   eng, f,41,19781227, ms, blake, merrickson, nsw, bigga,3805,9, rayner place, eventide homes, 612 47588446, 
rec-1008-org,   unk, f,31, , ms, chloe, abbetmeyer, nsw, wynnum west,4413,4, o dea place, kemminup farm, 2 22446244,5125486
rec-1009-dup-0, eng, f,25,19940413, ms, amy, croft, nsw, warnervae,6053,67, edmanhclose, , , 
rec-1009-dup-1, eng, r,25,19940413, ms, ay, crfot, nsw, warnrevale,6052,66, edman aclose, , 02 16842502, 
rec-1009-dup-2, eng, f,26,19940413, ms, amy, coft, nsg, warnervale,6052,63, edman coose, , 02 16842502, 
rec-1009-dup-3, eng, c,25,19947413, ms, amy, ctoft, nsw, warnervale,6052,60, edman coose, , 02 16842502, 
rec-1009-dup-4, eng, g,25,19944013, ms, amy, croft, nsw, warnevale,6052,6, edman cqose, , 02 16842502, 
rec-1009-org,   eng, f,25,19940413, ms, amy, croft, nsw, warnervale,6052,66, edman close, , 02 16842502, 
rec-101-dup-0, usa, m, ,19871829, , kristin, mercer, qld, nearym,4741,184, de graaf street, , 613 10355835, 
rec-101-dup-1, usa, n, ,19871129, , kristin, mercrr, qd, nearum,4740,184, de graaff street, , 613 13055835, 
rec-101-dup-2, usa, k, ,19871629, , krisgin, mercer, qld, nearmu,4740,183, de graaff street, , 613 10356835, 
rec-101-org,   usa, m, ,19871129, , kristin, mercer, qld, nearum,4740,183, de graaff street, , 613 10355835, 
rec-1010-org,   afr, f, ,19540303, , olivia, mbacke, nsw, ando,4124,112, duggan street, wayside, 612 38139227,5470388
rec-1011-dup-0, eng, f,37,19871115, mr, cade, hollands, nsq, rodd oint,3171,9, casey crescent, , 02 35700412, 
rec-1011-dup-1, eng, f,23,19871115, mr, cade, hollands, nswe, rodd poimt,3171,91, casey rcescent, , 02 35700412, 
rec-1011-dup-2, eng, f,32, , mr, cade, hollands, nsw, rodd point,3171,96, casey qrescent, tu nis, 08 95306495, 
rec-1011-dup-3, eng, d, ,19871115, mr, cae, hollands, nsw, rodd point, ,95, casey crescent, tunis, 02 35700412, 
rec-1011-org,   eng, f,32,19871115, mr, cade, hollands, nsw, rodd point,3171,91, casey crescent, tunis, 02 35700412, 
rec-1012-dup-0, ind, ,30, , , laurrn, jeevan, nsw, hengy,4810,4, bingley crescent, , 2 27402636, 
rec-1012-dup-1, ind, f,30,19890922, , jeevan, lauren, nse, henty,4810,45, bingley xrescent, , 2 27402636, 
rec-1012-dup-2, ind, ,30,19890922, , jeevan, lauren, nsw, henty,4810,49, bingley crescent, , 03 49347353, 
rec-1012-dup-3, ind, f,30,19890922, , laurren, jeevsn, nsw, henty,4180,47, bingley czescent, , 2 27402936, 
rec-1012-dup-4, ind, f,30,19890922, , lauren, jevean, nsw, h enty,4830,74, bingley crrscent, , 2 27402636, 
rec-1012-org,   ind, f,30,19890922, , lauren, jeevan, nsw, henty,4810,47, bingley crescent, , 2 27402636, 
rec-1013-dup-0, afr, d, , , ms, deakyn, venter, nsw, coia,3136,48, mackie crescent, lake kennedy street, 02 73962045, 
rec-1013-dup-1, afr, f, , , , deakun, venter, nsw, coila,3136,40, mackie crescent, , 02 73962045, 
rec-1013-dup-2, afr, f,63, , ms, deakhn, venter, nsw, coila,3136,94, mackie crsecent, , 02 73962045, 
rec-1013-dup-3, afr, f,36, , ms, deakn, vener, nsw, cola,3136,49, mackie crsecent, , 02 73962045, 
rec-1013-org,   afr, f,36, , ms, deakyn, venter, nsw, coila,3136,49, mackie crescent, westpoint, 02 73962045, 
rec-1014-dup-0, eng, f,27,19921317, , caitlin, harrelson, nsw, ando,1305,13, leichhardt street, carawa h rmb 2, 612 34754983, 
rec-1014-dup-1, eng, f,27,19923017, , caitlin, harrulson, nsw, and,3105,71, leichhardt street, , 612 34754483, 
rec-1014-dup-2, eng, f,27,19920317, , cairlin, harreson, nsw, ando,3150,17, leichharft street, , 612 34754483, 
rec-1014-dup-3, eng, f,27,19920317, , caitlkn, harrelson, nsw, and,3105,1, leichhard tstreet, carawah rmb 2, 612 43754483, 
rec-1014-dup-4, eng, f, ,19920317, , caitlin, harrelson, nsc, ando,1305,17, leichhard tstreet, , 612 34754483, 
rec-1014-org,   eng, f,27,19920317, , caitlin, harrelson, nsw, ando,3105,17, leichhardt street, carawah rmb 2, 612 34754483, 
rec-1015-dup-0, usa, m,23,19960834, , emiily, griffith, wk, nglba,3313,1, maidmentdplace, , 08 72121018, 
rec-1015-dup-1, usa, n,23,19960924, , emiil, griffith, wa, nolba,3013,3, maidment lace, , 08 72121018, 
rec-1015-org,   usa, m,23,19960824, , emiily, griffith, wa, nolba,3013,1, maidment place, , 08 72121018, 
rec-1016-dup-0, eng, , ,19661031, , daniel, derrixks, nsw, malvern,3844,16, burttcrescent, , , 
rec-1016-dup-1, eng, f, ,19671031, , daiel, derrikcs, nsw, wooberry,3844,42, burtt crwscent, , , 
rec-1016-dup-2, eng, f, ,19660131, , dankiel, derrcks, nsw, woodherry,3844,42, burtt credcent, , , 
rec-1016-dup-3, eng, f, ,19661031, , danieo, derrticks, nsw, woodbury,3844,24, burtt creccent, , , 
rec-1016-dup-4, eng, g, ,19661031, , daniel, derridks, nsq, woodbury,3844,41, burtt crescent, , , 
rec-1016-org,   eng, f, ,19661031, , daniel, derricks, nsw, woodberry,3844,42, burtt crescent, , , 
rec-1017-org,   chi, f,26,19930608, mr, hannah, chuo, wa, riverstone,3011,6, ellerston avenue, , 08 68942106, 
rec-1018-org,   usa, f,29,19900816, , clain, bean, vic, pheasant creek,4216,52, sargeant place, , 08 39730683, 
rec-1019-dup-0, unk, f,30,19891201, dr, shakifa, aaerg, nws, orient point,2506,3, macrossan crescent, , 02 09376058, 
rec-1019-dup-1, unk, f,30,19891202, dr, shakira, aaberg, nss, orient point,2569,30, macrossancrescent, , 02 09376058, 
rec-1019-org,   unk, f,30,19891201, dr, shakira, aaberg, nsw, orient point,2560,301, macrossan crescent, , 02 09376058, 
rec-102-dup-0, chi, m,19,20000771, ms, katelyn, paf, ns, cawongla,2220,7, heard sgreet, , 02 97545078, 
rec-102-dup-1, chi, m,19,20007017, ms, kateyn, pat, vic, ca wongla,2202,7, heard street, , 02 97540578, 
rec-102-org,   chi, m,19,20000717, ms, katelyn, pat, nsw, cawongla,2220,7, heard street, , 02 97540578, 
rec-1020-org,   eng, f,31,19881001, , brianna, pond, vic, tatura,7011,3, clive steele avenue, , 08 21083273, 
rec-1021-dup-0, ser, y,35,19890405, mr, rileh, hren, wa, ,3224,857, eyre steet, kincumber nautical vlge, 8 82322449,2174084
rec-1021-dup-1, ser, f,30,19890405, mr, rily, hren, w, ,3224,860, eyre steeet, kincumber nautical vlge, 8 82324249,2174084
rec-1021-dup-2, ser, f,30,19890405, mr, ryley, hrem, ws, ,3242,867, eyre street, kincumber nautcial vlge, 8 82322449,2174084
rec-1021-dup-3, ser, f,30,19890405, mr, ryley, hren, ws, ,3242,867, eyrebstreet, kincumber nautical vlge, 8 82322449, 
rec-1021-dup-4, ser, f,30,19890405, mr, rily, hren, wa, ,3214,867, eyre tsreet, , 8 82322449, 
rec-1021-org,   ser, f,30,19890405, mr, riley, hren, wa, ,3224,867, eyre street, kincumber nautical vlge, 8 82322449,2174084
rec-1022-org,   eng, f,34,19851226, ms, ryley, badcoke, vic, mitcham,5097,21, jaeger circuit, , 8 83710416, 
rec-1023-dup-0, ind, g,24,19950598, , eboy, vamshd, naw, basin view,5251,4, priddle street, , 612 75842964, 
rec-1023-dup-1, ind, f,24,19950508, , ebond, vamshie, nsn, basin view,5215,4, priddle srtreet, , 612 75842964, 
rec-1023-org,   ind, f,24,19950508, , ebony, vamshi, nsw, basin view,5251,4, priddle street, , 612 75842964, 
rec-1024-org,   wel, f,32,19871026, , christopher, craddock, nsw, mollymook,3995,142, gouger street, , 2 80812951, 
rec-1025-dup-0, ina, m,27, , , georgia, sutanto, qlj, pittswo rth,3197,103, northboure flats, , 03 53940449, 
rec-1025-dup-1, ina, f,28, , , georkgia, sutsnto, qdl, pittsworth,3917,13, northbourne flats, , 03 53940449, 
rec-1025-dup-2, ina, f, , , , gelrgia, sutanto, qlg, pittsworth,3197,1030, northbourne mflats, , 03 53940449, 
rec-1025-org,   ina, f,28, , , georgia, sutanto, qld, pittsworth,3197,103, northbourne flats, , 03 53940449, 
rec-1026-dup-0, eng, f,32,19870728, pfc, matrhew, meyrck, , mayfoeld,4710,177, dee street, , 03 07596795, 
rec-1026-dup-1, eng, f,32,19870728, , matthew, mehrick, , mayield,4170,170, dee mstreet, , 03 07596795, 
rec-1026-dup-2, eng, f,23,19870728, pfc, matthrew, meyrick, , mayfireld,4170,17, dee srteet, , 03 07956795, 
rec-1026-dup-3, eng, v, ,19877028, pfc, matthew, meyrick, , mayfiel,4170,18, dee street, , 03 07596795, 
rec-1026-dup-4, eng, f,32,19870728, pfc, matthew, meyricm, , mayfield,4107,18, dee steeet, , 03 07597695, 
rec-1026-org,   eng, f,32,19870728, pfc, matthew, meyrick, , mayfield,4170,17, dee street, , 03 07596795, 
rec-1027-dup-0, chi, f,93,19800503, , kyan, toy, wa, westdsle,2136,15, temperley dtreet, , 618 24669385, 
rec-1027-dup-1, chi, d,39,19800053, , kynna, toy, wk, westdale,2135,15, temperleu street, , 618 24669385, 
rec-1027-dup-2, chi, f,34,19800503, , kynan, tot, wa, westdae,2125,15, temperleey street, , 618 24669385, 
rec-1027-dup-3, chi, ,39,19800503, , kynna, toy, ws, westdle,2135,10, temperley street, , 618 24669385, 
rec-1027-dup-4, chi, f,39,19805003, , knyan, toy, wa, westdale,2135,5, temperleynstreet, , 618 42669385, 
rec-1027-org,   chi, f,39,19800503, , kynan, toy, wa, westdale,2135,15, temperley street, , 618 24669385, 
rec-1028-dup-0, unk, ,23,19960824, , lara, abbitt, qlx, mount cgalmers,4558,71, rich street, cowal, 613 89722697, 
rec-1028-dup-1, unk, g,23,19960824, , lata, abbistt, qld, mount cxhalmers,4558,17, rich street, , 613 89272697, 
rec-1028-dup-2, unk, f,25,19690824, , lars, abbitt, qld, mount chalmers,4558,17, richtstreet, , 613 89272697, 
rec-1028-dup-3, unk, r,23,19960284, , lara, abbit, qld, mount chalmers,4558,12, rich street, cwoal, 613 89272697, 
rec-1028-dup-4, unk, ,23,19960824, , lara, abbitt, qlk, mount chalmers,4585,17, rich street, cowql, 613 89242697, 
rec-1028-org,   unk, f,23,19960824, , lara, abbitt, qld, mount chalmers,4558,17, rich street, cowal, 613 89272697, 
rec-1029-dup-0, usa, j,13, , , monique, monror, st, elizabeth south,4118,14, nemarang crescent, , 07 94326387, 
rec-1029-dup-1, usa, m,32, , , moniuqe, monroe, as, elizabeth south,4118,14, nemarangcrescent, , 07 94316837, 
rec-1029-org,   usa, m,31, , , monique, monroe, sa, elizabeth south,4118,14, nemarang crescent, , 07 94316387, 
rec-103-dup-0, eng, ,32,19872118, , lexie, christinsen, qlz, oorindi,870,51, tiwi lpace, , 03 39068053, 
rec-103-org,   eng, ,32,19871218, , lexie, christinsen, qld, oorindi,870,50, tiwi place, , 03 39086053, 
rec-1030-org,   unk, m,26, , ms, molly, scottjackson, nsw, sylvania,3141,132, oakover circuit, redlands, 612 76865516, 
rec-1031-dup-0, eng, m, ,19670603, , hayedn, brigham, nsw, werrngton,2304,3, bardsleh place, , 612 78618837, 
rec-1031-dup-1, eng, m, ,19670603, , hayden, brigham, nss, werringon,2304,45, bardsley place, , 612 78616837, 
rec-1031-dup-2, eng, m, ,19670663, , hayden, brigham, nsw, werrigton,2304,4, bardsle place, , 612 78168837, 
rec-1031-dup-3, eng, f, ,19670203, , hayden, brigham, nsw, werrington,2304,4, bardsleycplace, nurock, 612 78168837, 
rec-1031-dup-4, eng, m, ,19670603, , hayen, brigham, sa, werrington,2304,2, bardsley place, lapsxone, 612 78628837, 
rec-1031-org,   eng, m, ,19670603, , hayden, brigham, nsw, werrington,2304,4, bardsley place, lapstone, 612 78618837, 
rec-1032-dup-0, chi, , ,19950607, , taylah, awyong, bsw, ,2154,58, bavinmstreet, jingara, 03 34076084, 
rec-1032-dup-1, chi, , ,19950607, , taulah, awyong, nsn, merrylands,2144,48, jingara, bavin street, 03 33076084, 
rec-1032-dup-2, chi, , ,19950697, , taylah, awylng, nsw, merrylands,2514,48, bavin street, jingarla, 03 33077084, 
rec-1032-dup-3, chi, , ,19950607, , tahlah, , nsw, merrylads,2154,48, bavin treet, jingara, 03 33077084, 
rec-1032-org,   chi, , ,19950607, , taylah, awyong, nsw, merrylands,2154,48, bavin street, jingara, 03 33076084, 
rec-1033-dup-0, cze, f,42,19956028, , patrick, walent, nsw, werri beach,3085,47, leycester olace, twin top, 03 86725379,6998717
rec-1033-dup-1, cze, f,24,19950628, , patrick, walnet, nss, werri byeach,3085,74, leycester place, parkglen, 2 94174291,6998717
rec-1033-dup-2, cze, f,24,19950628, , patrwck, walent, ntw, werri beach,3085,40, leycester place, millbanks, 2 94174491, 
rec-1033-dup-3, cze, f,24,19950628, , patrick, walenr, nsw, werri ceach,3085,7, leycester hplace, parkglen, 2 94173491,6998717
rec-1033-org,   cze, f,24,19950628, , patrick, walent, nsw, werri beach,3085,47, leycester place, parkglen, 2 94174491,6998717
rec-1034-dup-0, eng, f,53,19840614, dr, talia, osboune, wa, burraj rock,2518,4, godfrey street, , 08 13353884, 
rec-1034-dup-1, eng, f,35, , dr, talia, osbojrne, wa, burran rock,2518,24, godfrey atreet, , 08 13113884, 
rec-1034-dup-2, eng, f,31,19840614, dr, taloa, osbourne, ws, burran raock,2518,48, godfrey street, , 08 13313884, 
rec-1034-org,   eng, f,35,19840614, dr, talia, osbourne, wa, burran rock,2518,42, godfrey street, , 08 13313884, 
rec-1035-org,   chi, ,13,20061021, pfc, tiarna, chuo, vic, three bridges,7018,53, parkhill street, old green hill, 08 18872295, 
rec-1036-dup-0, chi, r,33,19860313, , , , qld, dinnerplain,2148,137, galloway sxreet, , 8 23588408, 
rec-1036-dup-1, chi, v,33,19860313, , , , vic, dinnerhplain,2184,137, gallowaystreet, , 8 23588408, 
rec-1036-dup-2, chi, f,33,19860313, , , , vid, dinnerzplain,2418,173, gallowaj street, brentwood village, 8 23588408, 
rec-1036-dup-3, chi, f,33,19870313, , , , vid, dinner plain,2148,173, galloways treet, , 8 23588408, 
rec-1036-dup-4, chi, f,33,19863013, , , , vic, dinnerfplain,2148,138, galloway street, brentwoodvillage, 8 23586408, 
rec-1036-org,   chi, f,33,19860313, , , , vic, dinner plain,2148,137, galloway street, brentwood village, 8 23588408, 
rec-1037-dup-0, ind, , ,19640140, , jacob, shaykat, qld, deepwter,3048,1, wandoo street, , 03 06877449, 
rec-1037-dup-1, ind, , ,19640150, , jacpb, shaukzt, qld, deepwater,3084,19, wandoo dtreet, , 03 06877449, 
rec-1037-dup-2, ind, , ,19640130, , jaclb, shaukat, qlf, deepeater,3804,19, wandoo street, , 03 06877449, 
rec-1037-dup-3, ind, , ,19641030, , jacob, shajkat, qlad, deepwiater,3084,10, wandop street, , 03 06877449, 
rec-1037-org,   ind, , ,19640130, , jacob, shaukat, qld, deepwater,3084,10, wandoo street, , 03 06877449, 
rec-1038-org,   usa, m,27,19920326, , lachlan, tran, vic, rosewhite,2114,7, yanda street, , 618 69736779, 
rec-1039-dup-0, unk, f, ,19121127, , brinley, stratou, nsw, coolanon,3149,15, gosse steet, , 2 80743341,5245270
rec-1039-dup-1, unk, f, ,19121127, , brinly, stratou, nsz, coolamion,3914,91, gosse street, , 2 80744341,5245270
rec-1039-dup-2, unk, f, ,19121217, , brinley, stratou, nsw, coolamon,3194,18, gosse ztreet, , 2 80744241, 
rec-1039-dup-3, unk, f, ,19121127, , brinley, stratuo, nsw, coolamdn,3149,91, gosse street, , 2 80744341, 
rec-1039-dup-4, unk, , ,19140305, , brinley, stratou, ns, coolamfon,3194,19, gosse wtreet, , 2 80744341,5245270
rec-1039-org,   unk, f, ,19121127, , brinley, stratou, nsw, coolamon,3194,19, gosse street, , 2 80744341,5245270
rec-104-org,   usa, f, , , , benjamin, hodges, vic, elmore,6057,17, , , 08 64677469, 
rec-1040-org,   dut, f,29,19901028, , jordan, dezoete, qld, pacific heights,4219,14, yampi place, southwood haven, 3 54174640, 
rec-1041-dup-0, ara, g,29,19900330, ms, jaclb, marsm, vic, newbrihge,2640,69, eldershaw place, , 08 59130610, 
rec-1041-dup-1, ara, f,29,19900330, ms, jaclb, maram, vic, newbridgw,2640,670, eldershaw pkace, , 08 59103610, 
rec-1041-dup-2, ara, f, ,19900330, ms, jacob, maram, vic, newbrige,2640,69, eldershqw place, , 08 59132610, 
rec-1041-dup-3, ara, d,29, , ms, giacobo, maram, vic, newbridge,2640, , eldershaw place, , 04 75133062, 
rec-1041-dup-4, ara, ,29,19900330, ms, jacpb, maram, vic, newbrirge,2640,60, eldershaq place, , 08 59120610, 
rec-1041-org,   ara, f,29,19900330, ms, jacob, maram, vic, newbridge,2640,60, eldershaw place, , 08 59130610, 
rec-1042-dup-0, unk, f,24,19960206, hon, giahni, scjum, sz, panorama,4214,21, cornishplace, belmont park, 617 19339837, 
rec-1042-dup-1, unk, f,32,19960206, hon, gianni, scjuk, sa, panorama,4214,31, cornish ylace, bonaccord, 617 19329837, 
rec-1042-dup-2, unk, v,23,19960206, hon, gianni, scujm, as, panorma,4214,219, cornish place, bonaccord, 617 19339837, 
rec-1042-dup-3, unk, c,23,19960206, hon, gianni, scjum, sa, panorqma,4214,21, cornishhplace, , 03 78802625, 
rec-1042-dup-4, unk, d,23,19960206, , gianni, scjum, sa, panorma,4214,20, cornish olace, bonaccord, 617 19339837, 
rec-1042-org,   unk, f,23,19960206, hon, gianni, scjum, sa, panorama,4214,21, cornish place, bonaccord, 617 19339837, 
rec-1043-dup-0, unk, n,36,19830701, , scottjackson, brody, tas, quambone,4129,8, , , 612 06461832, 
rec-1043-dup-1, unk, m,24,19839701, , brody, scottjackson, esw, quambone,4129,3, maranoa street, , 612 06481832, 
rec-1043-dup-2, unk, ,37,19830701, , brody, scottajckson, nsw, quambone,4129,7, maranoa sfreet, , 612 06461832, 
rec-1043-org,   unk, m,36,19830701, , brody, scottjackson, nsw, quambone,4129,8, maranoa street, , 612 06461832, 
rec-1044-dup-0, ind, ,30,19460321, , jaek, virasdana, vic, bungeet,5174,4, fullagar crescent, , 8 11029654, 
rec-1044-dup-1, ind, r,39,19840211, , jake, viarsana, vic, bungret,5174,4, gurr street, , 8 11029654, 
rec-1044-dup-2, ind, c,30,19890411, , jake, virasans, vic, bunget,5174,5, gurr street, , 8 11029654, 
rec-1044-dup-3, ind, f,30, , , jakw, virasama, vic, bungeet,5174,4, gurr sreet, , 8 11026654, 
rec-1044-dup-4, ind, f,39,19890211, , jake, virasna, voc, bungeet,5147,4, gurrostreet, , 8 11029654, 
rec-1044-org,   ind, f,30,19890211, , jake, virasana, vic, bungeet,5174,4, gurr street, , 8 11029654, 
rec-1045-dup-0, ara, ,25,19910822, mr, annabelle, jahankhagoon, nsw, killarney eights, ,71, bisdee street, emoh, 612 83878861, 
rec-1045-dup-1, ara, ,28,19151214, mr, annabele, jahankhatoon, nsw, killarney heights,2034,18, bisdee stteet, , 612 83878861, 
rec-1045-dup-2, ara, ,28,19910822, mr, annabekle, jahankhatoon, nsw, killarney heights,2043,175, bisdee street, eomh, 07 20561972, 
rec-1045-dup-3, ara, ,28,19910832, mr, jahankhatoon, annabelle, nsw, killarney heights,2034,17, bisdee gstreet, emob, 612 83878861, 
rec-1045-org,   ara, ,28,19910822, mr, annabelle, jahankhatoon, nsw, killarney heights,2034,17, bisdee street, emoh, 612 83878861, 